Reaction Details
TargetPhosphatidylinositol 4,5-bisphosphate 3-kinase catalytic subunit alpha isoform
LigandBDBM50089328
Substrate/Competitorn/a
Meas. Tech.ChEMBL_1496312 (CHEMBL3579761)
IC50 0.070000±n/a nM
Citation Han, FLin, SLiu, PLiu, XTao, JDeng, XYi, CXu, H Discovery of a Novel Series of Thienopyrimidine as Highly Potent and Selective PI3K Inhibitors. ACS Med Chem Lett6:434-8 (2015) 
 
Phosphatidylinositol 4,5-bisphosphate 3-kinase catalytic subunit alpha isoform
Name:Phosphatidylinositol 4,5-bisphosphate 3-kinase catalytic subunit alpha isoform
Type:Enzyme Subunit
Mol. Mass.:124294.87
Organism:Homo sapiens (Human)
Description:P42336
Residue:1068
BDBM50089328
NameBDBM50089328
Synonyms:CHEMBL3577914
TypeSmall organic molecule
Emp. Form.C25H18F2N6O3S
Mol. Mass.520.511
SMILESCOc1ncc(cc1NS(=O)(=O)c1ccc(F)cc1F)-c1ccc2nc(N)nc(-c3ccncc3)c2c1