Reaction Details
TargetMuscarinic acetylcholine receptor M2
LigandBDBM50089354
Substrate/Competitorn/a
Meas. Tech.ChEMBL_1496345 (CHEMBL3579949)
Ki 4010±n/a nM
Citation Carter, PHBrown, GDCherney, RJBatt, DGChen, JClark, CMCvijic, MEDuncia, JVKo, SSMandlekar, SMo, RNelson, DJPang, JRose, AVSantella, JBTebben, AJTraeger, SCXu, SZhao, QBarrish, JC Discovery of a Potent and Orally Bioavailable Dual Antagonist of CC Chemokine Receptors 2 and 5. ACS Med Chem Lett6:439-44 (2015) 
 
Muscarinic acetylcholine receptor M2
Name:Muscarinic acetylcholine receptor M2
Type:GPCR
Mol. Mass.:51730.61
Organism:Homo sapiens (Human)
Description:P08172
Residue:466
BDBM50089354
NameBDBM50089354
Synonyms:CHEMBL3577945
TypeSmall organic molecule
Emp. Form.C26H36F3N5O
Mol. Mass.491.5921
SMILESCCC[C@@H]1C[C@@H](CC[C@@H]1N1CC[C@H](Nc2ncnc3ccc(cc23)C(F)(F)F)C1=O)N(C)C(C)C