Reaction Details
TargetHistamine H3 receptor
LigandBDBM50089372
Substrate/Competitorn/a
Meas. Tech.ChEMBL_1496464 (CHEMBL3578410)
Ki 1.3±n/a nM
Citation Letavic, MAAluisio, LApodaca, RBajpai, MBarbier, AJBonneville, ABonaventure, PCarruthers, NIDugovic, CFraser, ICKramer, MLLord, BLovenberg, TWLi, LYLy, KSMcallister, HMani, NSMorton, KLNdifor, ANepomuceno, SDPandit, CRSands, SBShah, CRShelton, JESnook, SSSwanson, DMXiao, W Novel benzamide-based histamine h3 receptor antagonists: the identification of two candidates for clinical development. ACS Med Chem Lett6:450-4 (2015) 
 
Histamine H3 receptor
Name:Histamine H3 receptor
Type:G Protein-Coupled Receptor (GPCR)
Mol. Mass.:48691.47
Organism:Homo sapiens (Human)
Description:Binding assays were using CHO cells stably expressing hH3R receptors.
Residue:445
BDBM50089372
NameBDBM50089372
Synonyms:CHEMBL3577956
TypeSmall organic molecule
Emp. Form.C20H29N3O2
Mol. Mass.343.4632
SMILESO=C(N1CCN(CC1)C1CCC1)c1ccc(CN2CCOCC2)cc1