Reaction Details
TargetHistamine H3 receptor
LigandBDBM50346208
Substrate/Competitorn/a
Meas. Tech.ChEMBL_1496464 (CHEMBL3578410)
Ki 1.3±n/a nM
Citation Letavic, MAAluisio, LApodaca, RBajpai, MBarbier, AJBonneville, ABonaventure, PCarruthers, NIDugovic, CFraser, ICKramer, MLLord, BLovenberg, TWLi, LYLy, KSMcallister, HMani, NSMorton, KLNdifor, ANepomuceno, SDPandit, CRSands, SBShah, CRShelton, JESnook, SSSwanson, DMXiao, W Novel benzamide-based histamine h3 receptor antagonists: the identification of two candidates for clinical development. ACS Med Chem Lett6:450-4 (2015) 
 
Histamine H3 receptor
Name:Histamine H3 receptor
Type:G Protein-Coupled Receptor (GPCR)
Mol. Mass.:48691.47
Organism:Homo sapiens (Human)
Description:Binding assays were using CHO cells stably expressing hH3R receptors.
Residue:445
BDBM50346208
NameBDBM50346208
Synonyms:(1-isopropylpiperidin-4-yl)(4-(piperidin-1-ylmethyl)phenyl)methanone | CHEMBL1783889
TypeSmall organic molecule
Emp. Form.C20H31N3O
Mol. Mass.329.4796
SMILESCC(C)N1CCN(CC1)C(=O)c1ccc(CN2CCCCC2)cc1