Reaction Details
TargetHistamine H3 receptor
LigandBDBM50089374
Substrate/Competitorn/a
Meas. Tech.ChEMBL_1496464 (CHEMBL3578410)
Ki 1.000000±n/a nM
Citation Letavic, MAAluisio, LApodaca, RBajpai, MBarbier, AJBonneville, ABonaventure, PCarruthers, NIDugovic, CFraser, ICKramer, MLLord, BLovenberg, TWLi, LYLy, KSMcallister, HMani, NSMorton, KLNdifor, ANepomuceno, SDPandit, CRSands, SBShah, CRShelton, JESnook, SSSwanson, DMXiao, W Novel benzamide-based histamine h3 receptor antagonists: the identification of two candidates for clinical development. ACS Med Chem Lett6:450-4 (2015) 
 
Histamine H3 receptor
Name:Histamine H3 receptor
Type:G Protein-Coupled Receptor (GPCR)
Mol. Mass.:48691.47
Organism:Homo sapiens (Human)
Description:Binding assays were using CHO cells stably expressing hH3R receptors.
Residue:445
BDBM50089374
NameBDBM50089374
Synonyms:CHEMBL3577954
TypeSmall organic molecule
Emp. Form.C21H33N3O
Mol. Mass.343.5062
SMILESCC(C)N1CCN(CC1)C(=O)c1ccc(CN2CCCCCC2)cc1