Reaction Details
TargetMelanocortin receptor 3
LigandBDBM50089420
Substrate/Competitorn/a
Meas. Tech.ChEMBL_1496670 (CHEMBL3579241)
Ki 790±n/a nM
Citation Ericson, MDWilczynski, ASorensen, NBXiang, ZHaskell-Luevano, C Discovery of aß-Hairpin Octapeptide, c[Pro-Arg-Phe-Phe-Dap-Ala-Phe-DPro], Mimetic of Agouti-Related Protein(87-132) [AGRP(87-132)] with Equipotent Mouse Melanocortin-4 Receptor (mMC4R) Antagonist Pharmacology. J Med Chem58:4638-47 (2015) 
 
Melanocortin receptor 3
Name:Melanocortin receptor 3
Type:PROTEIN
Mol. Mass.:35808.24
Organism:Mus musculus
Description:ChEMBL_1498848
Residue:323
BDBM50089420
NameBDBM50089420
Synonyms:CHEMBL3577976
TypeSmall organic molecule
Emp. Form.C82H110N22O19S2
Mol. Mass.1772.017
SMILESC[C@@H](O)[C@H](NC(C)=O)C(=O)N[C@@H](C)C(=O)N[C@@H](Cc1ccc(O)cc1)C(=O)N[C@H]1CSSC[C@H](NC(=O)[C@H](Cc2ccccc2)NC(=O)[C@H](C)NC(=O)[C@H](CC(N)=O)NC(=O)[C@H](Cc2ccccc2)NC(=O)[C@H](Cc2ccccc2)NC(=O)[C@H](CCCNC(N)=N)NC1=O)C(=O)N[C@@H](Cc1ccc(O)cc1)C(=O)N[C@@H](C)C(=O)N[C@@H](CCCNC(N)=N)C(N)=O