Reaction Details
TargetMelanocortin receptor 3
LigandBDBM50089399
Substrate/Competitorn/a
Meas. Tech.ChEMBL_1496670 (CHEMBL3579241)
Ki 630±n/a nM
Citation Ericson, MDWilczynski, ASorensen, NBXiang, ZHaskell-Luevano, C Discovery of aß-Hairpin Octapeptide, c[Pro-Arg-Phe-Phe-Dap-Ala-Phe-DPro], Mimetic of Agouti-Related Protein(87-132) [AGRP(87-132)] with Equipotent Mouse Melanocortin-4 Receptor (mMC4R) Antagonist Pharmacology. J Med Chem58:4638-47 (2015) 
 
Melanocortin receptor 3
Name:Melanocortin receptor 3
Type:PROTEIN
Mol. Mass.:35808.24
Organism:Mus musculus
Description:ChEMBL_1498848
Residue:323
BDBM50089399
NameBDBM50089399
Synonyms:CHEMBL3577982
TypeSmall organic molecule
Emp. Form.C56H68N12O9
Mol. Mass.1053.2141
SMILES[H][C@@]12CCCN1C(=O)[C@@]1([H])CCCN1C(=O)[C@H](Cc1ccccc1)NC(=O)[C@H](C)NC(=O)[C@H](CC(N)=O)NC(=O)[C@H](Cc1ccccc1)NC(=O)[C@H](Cc1ccc(cc1)-c1ccccc1)NC(=O)[C@H](CCCNC(N)=N)NC2=O