Reaction Details
TargetMelanocortin receptor 3
LigandBDBM50089416
Substrate/Competitorn/a
Meas. Tech.ChEMBL_1496670 (CHEMBL3579241)
Ki 160±n/a nM
Citation Ericson, MDWilczynski, ASorensen, NBXiang, ZHaskell-Luevano, C Discovery of aß-Hairpin Octapeptide, c[Pro-Arg-Phe-Phe-Dap-Ala-Phe-DPro], Mimetic of Agouti-Related Protein(87-132) [AGRP(87-132)] with Equipotent Mouse Melanocortin-4 Receptor (mMC4R) Antagonist Pharmacology. J Med Chem58:4638-47 (2015) 
 
Melanocortin receptor 3
Name:Melanocortin receptor 3
Type:PROTEIN
Mol. Mass.:35808.24
Organism:Mus musculus
Description:ChEMBL_1498848
Residue:323
BDBM50089416
NameBDBM50089416
Synonyms:CHEMBL3577998
TypeSmall organic molecule
Emp. Form.C51H68N12O8
Mol. Mass.977.1612
SMILES[H][C@@]12CCCN1C(=O)[C@@]1([H])CCCN1C(=O)[C@H](Cc1ccccc1)NC(=O)[C@H](C)NC(=O)C(CCCN)NC(=O)[C@H](Cc1ccccc1)NC(=O)[C@H](Cc1ccccc1)NC(=O)[C@H](CCCNC(N)=N)NC2=O