Reaction Details
TargetMelanocortin receptor 4
LigandBDBM50089415
Substrate/Competitorn/a
Meas. Tech.ChEMBL_1496671 (CHEMBL3579242)
Ki 4.0±n/a nM
Citation Ericson, MDWilczynski, ASorensen, NBXiang, ZHaskell-Luevano, C Discovery of aß-Hairpin Octapeptide, c[Pro-Arg-Phe-Phe-Dap-Ala-Phe-DPro], Mimetic of Agouti-Related Protein(87-132) [AGRP(87-132)] with Equipotent Mouse Melanocortin-4 Receptor (mMC4R) Antagonist Pharmacology. J Med Chem58:4638-47 (2015) 
 
Melanocortin receptor 4
Name:Melanocortin receptor 4
Type:PROTEIN
Mol. Mass.:36964.43
Organism:Mus musculus
Description:ChEMBL_1498850
Residue:332
BDBM50089415
NameBDBM50089415
Synonyms:CHEMBL3577997
TypeSmall organic molecule
Emp. Form.C50H66N12O8
Mol. Mass.963.1346
SMILES[H][C@@]12CCCN1C(=O)[C@@]1([H])CCCN1C(=O)[C@H](Cc1ccccc1)NC(=O)[C@H](C)NC(=O)C(CCN)NC(=O)[C@H](Cc1ccccc1)NC(=O)[C@H](Cc1ccccc1)NC(=O)[C@H](CCCNC(N)=N)NC2=O