Reaction Details
TargetHypoxanthine-guanine phosphoribosyltransferase
LigandBDBM50010318
Substrate/Competitorn/a
Meas. Tech.ChEMBL_1496953 (CHEMBL3579427)
Ki 5800±n/a nM
Citation Eng, WSHocková, D?pacek, PJaneba, ZWest, NPWoods, KNaesens, LMKeough, DTGuddat, LW First Crystal Structures of Mycobacterium tuberculosis 6-Oxopurine Phosphoribosyltransferase: Complexes with GMP and Pyrophosphate and with Acyclic Nucleoside Phosphonates Whose Prodrugs Have Antituberculosis Activity. J Med Chem58:4822-38 (2015) 
 
Hypoxanthine-guanine phosphoribosyltransferase
Name:Hypoxanthine-guanine phosphoribosyltransferase
Type:Protein
Mol. Mass.:24579.61
Organism:Homo sapiens (Human)
Description:P00492
Residue:218
BDBM50010318
NameBDBM50010318
Synonyms:CHEBI:17345 | CHEMBL283807
TypeSmall organic molecule
Emp. Form.C10H14N5O8P
Mol. Mass.363.2206
SMILESNc1nc2n(cnc2c(=O)[nH]1)[C@@H]1O[C@H](COP(O)(O)=O)[C@@H](O)[C@H]1O