Reaction Details
TargetHypoxanthine-guanine phosphoribosyltransferase
LigandBDBM50089449
Substrate/Competitorn/a
Meas. Tech.ChEMBL_1496953 (CHEMBL3579427)
Ki 30±n/a nM
Citation Eng, WSHocková, D?pacek, PJaneba, ZWest, NPWoods, KNaesens, LMKeough, DTGuddat, LW First Crystal Structures of Mycobacterium tuberculosis 6-Oxopurine Phosphoribosyltransferase: Complexes with GMP and Pyrophosphate and with Acyclic Nucleoside Phosphonates Whose Prodrugs Have Antituberculosis Activity. J Med Chem58:4822-38 (2015) 
 
Hypoxanthine-guanine phosphoribosyltransferase
Name:Hypoxanthine-guanine phosphoribosyltransferase
Type:Protein
Mol. Mass.:24579.61
Organism:Homo sapiens (Human)
Description:P00492
Residue:218
BDBM50089449
NameBDBM50089449
Synonyms:CHEMBL3578114
TypeSmall organic molecule
Emp. Form.C15H30N7O10P3
Mol. Mass.561.3609
SMILESNc1nc2n(CCN(CCN(CCP(O)(O)=O)CCP(O)(O)=O)CCP(O)(O)=O)cnc2c(=O)[nH]1