Reaction Details
TargetTyrosine-protein kinase Fyn
LigandBDBM50089526
Substrate/Competitorn/a
Meas. Tech.ChEMBL_1497041 (CHEMBL3580016)
Ki 2100±n/a nM
Citation Tintori, CLa Sala, GVignaroli, GBotta, LFallacara, ALFalchi, FRadi, MZamperini, CDreassi, EDello Iacono, LOrioli, DBiamonti, GGarbelli, MLossani, AGasparrini, FTuccinardi, TLaurenzana, IAngelucci, AMaga, GSchenone, SBrullo, CMusumeci, FDesogus, ACrespan, EBotta, M Studies on the ATP Binding Site of Fyn Kinase for the Identification of New Inhibitors and Their Evaluation as Potential Agents against Tauopathies and Tumors. J Med Chem58:4590-609 (2015) 
 
Tyrosine-protein kinase Fyn
Name:Tyrosine-protein kinase Fyn
Type:Enzyme
Mol. Mass.:60762.21
Organism:Homo sapiens (Human)
Description:P06241
Residue:537
BDBM50089526
NameBDBM50089526
Synonyms:CHEMBL3578224
TypeSmall organic molecule
Emp. Form.C27H24FN3O4
Mol. Mass.473.4956
SMILESCCc1ccc2[nH]c(=O)c(CN(Cc3ccc4OCOc4c3)C(=O)Nc3ccc(F)cc3)cc2c1