Reaction Details
TargetTyrosine-protein kinase Fyn
LigandBDBM50089534
Substrate/Competitorn/a
Meas. Tech.ChEMBL_1497041 (CHEMBL3580016)
Ki 10000±n/a nM
Citation Tintori, CLa Sala, GVignaroli, GBotta, LFallacara, ALFalchi, FRadi, MZamperini, CDreassi, EDello Iacono, LOrioli, DBiamonti, GGarbelli, MLossani, AGasparrini, FTuccinardi, TLaurenzana, IAngelucci, AMaga, GSchenone, SBrullo, CMusumeci, FDesogus, ACrespan, EBotta, M Studies on the ATP Binding Site of Fyn Kinase for the Identification of New Inhibitors and Their Evaluation as Potential Agents against Tauopathies and Tumors. J Med Chem58:4590-609 (2015) 
 
Tyrosine-protein kinase Fyn
Name:Tyrosine-protein kinase Fyn
Type:Enzyme
Mol. Mass.:60762.21
Organism:Homo sapiens (Human)
Description:P06241
Residue:537
BDBM50089534
NameBDBM50089534
Synonyms:CHEMBL3578222
TypeSmall organic molecule
Emp. Form.C21H21N5S
Mol. Mass.375.49
SMILESCNc1nc(SC)nc2n(CCc3ccccc3)nc(-c3ccccc3)c12