Reaction Details
TargetHistone deacetylase 8
LigandBDBM50089657
Substrate/Competitorn/a
Meas. Tech.ChEMBL_1496074 (CHEMBL3578553)
Ki 7000±n/a nM
Citation Daniel, KBSullivan, EDChen, YChan, JCJennings, PAFierke, CACohen, SM Dual-Mode HDAC Prodrug for Covalent Modification and Subsequent Inhibitor Release. J Med Chem58:4812-21 (2015) 
 
Histone deacetylase 8
Name:Histone deacetylase 8
Type:Enzyme
Mol. Mass.:41749.60
Organism:Homo sapiens (Human)
Description:Q9BY41
Residue:377
BDBM50089657
NameBDBM50089657
Synonyms:CHEMBL3577298
TypeSmall organic molecule
Emp. Form.C24H30N2O5
Mol. Mass.426.5054
SMILESCC1=C(C)C(=O)C(CONC(=O)CCCCCCC(=O)Nc2ccccc2)=C(C)C1=O