Reaction Details
TargetBeta-hexosaminidase subunit alpha
LigandBDBM18512
Substrate/Competitorn/a
Meas. Tech.ChEMBL_1496352 (CHEMBL3579956)
IC50 17000±n/a nM
Citation Tropak, MBZhang, JYonekawa, SRigat, BAAulakh, VSSmith, MRHwang, HJCiufolini, MAMahuran, DJ Pyrimethamine Derivatives: Insight into Binding Mechanism and Improved Enhancement of Mutantß-N-acetylhexosaminidase Activity. J Med Chem58:4483-93 (2015) 
 
Beta-hexosaminidase subunit alpha
Name:Beta-hexosaminidase subunit alpha
Type:Protein
Mol. Mass.:60688.46
Organism:Homo sapiens (Human)
Description:P06865
Residue:529
BDBM18512
NameBDBM18512
Synonyms:5-(4-chlorophenyl)-6-ethylpyrimidine-2,4-diamine Pyrimethamine (Pyr) cid_4993
TypeSmall organic molecule
Emp. Form.C12H13ClN4
Mol. Mass.248.711
SMILESCCc1nc(N)nc(N)c1-c1ccc(Cl)cc1