Reaction Details
TargetBeta-hexosaminidase subunit alpha
LigandBDBM50089682
Substrate/Competitorn/a
Meas. Tech.ChEMBL_1496352 (CHEMBL3579956)
IC50 43000±n/a nM
Citation Tropak, MBZhang, JYonekawa, SRigat, BAAulakh, VSSmith, MRHwang, HJCiufolini, MAMahuran, DJ Pyrimethamine Derivatives: Insight into Binding Mechanism and Improved Enhancement of Mutantß-N-acetylhexosaminidase Activity. J Med Chem58:4483-93 (2015) 
 
Beta-hexosaminidase subunit alpha
Name:Beta-hexosaminidase subunit alpha
Type:Protein
Mol. Mass.:60688.46
Organism:Homo sapiens (Human)
Description:P06865
Residue:529
BDBM50089682
NameBDBM50089682
Synonyms:CHEMBL3577323
TypeSmall organic molecule
Emp. Form.C13H16N4
Mol. Mass.228.2929
SMILESCCc1nc(N)nc(N)c1-c1ccccc1C