Reaction Details
TargetBeta-hexosaminidase subunit alpha
LigandBDBM50089683
Substrate/Competitorn/a
Meas. Tech.ChEMBL_1496352 (CHEMBL3579956)
IC50 47000±n/a nM
Citation Tropak, MBZhang, JYonekawa, SRigat, BAAulakh, VSSmith, MRHwang, HJCiufolini, MAMahuran, DJ Pyrimethamine Derivatives: Insight into Binding Mechanism and Improved Enhancement of Mutantß-N-acetylhexosaminidase Activity. J Med Chem58:4483-93 (2015) 
 
Beta-hexosaminidase subunit alpha
Name:Beta-hexosaminidase subunit alpha
Type:Protein
Mol. Mass.:60688.46
Organism:Homo sapiens (Human)
Description:P06865
Residue:529
BDBM50089683
NameBDBM50089683
Synonyms:CHEMBL3577324
TypeSmall organic molecule
Emp. Form.C14H18N4
Mol. Mass.242.3195
SMILESCCc1nc(N)nc(N)c1-c1cc(C)cc(C)c1