Reaction Details
TargetBeta-hexosaminidase subunit alpha
LigandBDBM18788
Substrate/Competitorn/a
Meas. Tech.ChEMBL_1496348 (CHEMBL3579952)
pH7±n/a
IC50 11000±n/a nM
Commentsextracted
Citation Tropak, MBZhang, JYonekawa, SRigat, BAAulakh, VSSmith, MRHwang, HJCiufolini, MAMahuran, DJ Pyrimethamine Derivatives: Insight into Binding Mechanism and Improved Enhancement of Mutantß-N-acetylhexosaminidase Activity. J Med Chem58:4483-93 (2015) 
 
Beta-hexosaminidase subunit alpha
Name:Beta-hexosaminidase subunit alpha
Type:Protein
Mol. Mass.:60688.46
Organism:Homo sapiens (Human)
Description:P06865
Residue:529
BDBM18788
NameBDBM18788
Synonyms:6-ethyl-5-phenylpyrimidine-2,4-diamine P20
TypeSmall organic molecule
Emp. Form.C12H14N4
Mol. Mass.214.2664
SMILESCCc1nc(N)nc(N)c1-c1ccccc1