Reaction Details
TargetCarboxypeptidase B
LigandBDBM50089691
Substrate/Competitorn/a
Meas. Tech.ChEMBL_1496384 (CHEMBL3580150)
IC50 1.000000±n/a nM
Citation Halland, NBrönstrup, MCzech, JCzechtizky, WEvers, AFollmann, MKohlmann, MSchiell, MKurz, MSchreuder, HAKallus, C Novel Small Molecule Inhibitors of Activated Thrombin Activatable Fibrinolysis Inhibitor (TAFIa) from Natural Product Anabaenopeptin. J Med Chem58:4839-44 (2015) 
 
Carboxypeptidase B
Name:Carboxypeptidase B
Type:Enzyme
Mol. Mass.:47367.43
Organism:Homo sapiens (Human)
Description:P15086
Residue:417
BDBM50089691
NameBDBM50089691
Synonyms:CHEMBL3577425
TypeSmall organic molecule
Emp. Form.C26H46N4O4
Mol. Mass.478.6678
SMILESCC1(C)C2CCC1(C)CC2NC(=O)[C@@H](CC1CCCCC1)NC(=O)N[C@@H](CCCCN)C(O)=O