Reaction Details
TargetCarboxypeptidase B2
LigandBDBM50089749
Substrate/Competitorn/a
Meas. Tech.ChEMBL_1496377 (CHEMBL3580143)
IC50 7.0±n/a nM
Citation Halland, NBrönstrup, MCzech, JCzechtizky, WEvers, AFollmann, MKohlmann, MSchiell, MKurz, MSchreuder, HAKallus, C Novel Small Molecule Inhibitors of Activated Thrombin Activatable Fibrinolysis Inhibitor (TAFIa) from Natural Product Anabaenopeptin. J Med Chem58:4839-44 (2015) 
 
Carboxypeptidase B2
Name:Carboxypeptidase B2
Type:Enzyme
Mol. Mass.:48432.74
Organism:Homo sapiens (Human)
Description:Q96IY4
Residue:423
BDBM50089749
NameBDBM50089749
Synonyms:CHEMBL3577433
TypeSmall organic molecule
Emp. Form.C23H40N4O4
Mol. Mass.436.5881
SMILESCC1(C)C2CCC1(C)CC2NC(=O)[C@@H](CC1CC1)NC(=O)N[C@@H](CCCCN)C(O)=O