Reaction Details
TargetChitinase B
LigandBDBM50089846
Substrate/Competitorn/a
Meas. Tech.ChEMBL_1496849 (CHEMBL3580203)
IC50 374±n/a nM
Citation Sugawara, AMaita, NGouda, HYamamoto, THirose, TKimura, SSaito, YNakano, HKasai, TNakano, HShiomi, KHirono, SWatanabe, TTaniguchi, HOmura, SSunazuka, T Creation of Customized Bioactivity within a 14-Membered Macrolide Scaffold: Design, Synthesis, and Biological Evaluation Using a Family-18 Chitinase. J Med Chem58:4984-97 (2015) 
 
Chitinase B
Name:Chitinase B
Type:Enzyme
Mol. Mass.:55462.70
Organism:Serratia marcescens
Description:P11797
Residue:499
BDBM50089846
NameBDBM50089846
Synonyms:CHEMBL3577621
TypeSmall organic molecule
Emp. Form.C37H65N5O9
Mol. Mass.723.9401
SMILES[H][C@@]12OC(C)(C)O[C@]([H])([C@H]1C)C(C)(C)[C@@H](CC)OC(=O)[C@H](C)[C@@H](OC(=O)NCCCCCNC(=N)NC(=O)NC)[C@H](C)[C@@H](OCC#C)[C@](C)(O)C[C@H]2C