Reaction Details
TargetL-lactate dehydrogenase B chain
LigandBDBM50089927
Substrate/Competitorn/a
Meas. Tech.ChEMBL_1499430 (CHEMBL3583865)
IC50 410±n/a nM
Citation Labadie, SDragovich, PSChen, JFauber, BPBoggs, JCorson, LBDing, CZEigenbrot, CGe, HHo, QLai, KWMa, SMalek, SPeterson, DPurkey, HERobarge, KSalphati, LSideris, SUltsch, MVanderPorten, EWei, BXu, QYen, IYue, QZhang, HZhang, XZhou, A Optimization of 5-(2,6-dichlorophenyl)-3-hydroxy-2-mercaptocyclohex-2-enones as potent inhibitors of human lactate dehydrogenase. Bioorg Med Chem Lett25:75-82 (2015) 
 
L-lactate dehydrogenase B chain
Name:L-lactate dehydrogenase B chain
Type:Oxidoreductase; homotetramer
Mol. Mass.:36635.55
Organism:Homo sapiens (Human)
Description:n/a
Residue:334
BDBM50089927
NameBDBM50089927
Synonyms:CHEMBL3581200
TypeSmall organic molecule
Emp. Form.C22H21Cl3O4S
Mol. Mass.487.824
SMILESCOc1ccc(Cl)c(SC2=C(O)CC(CC2=O)c2c(Cl)ccc(OC(C)C)c2Cl)c1