Reaction Details
TargetL-lactate dehydrogenase A chain
LigandBDBM50089926
Substrate/Competitorn/a
Meas. Tech.ChEMBL_1499429 (CHEMBL3583864)
IC50 15±n/a nM
Citation Labadie, SDragovich, PSChen, JFauber, BPBoggs, JCorson, LBDing, CZEigenbrot, CGe, HHo, QLai, KWMa, SMalek, SPeterson, DPurkey, HERobarge, KSalphati, LSideris, SUltsch, MVanderPorten, EWei, BXu, QYen, IYue, QZhang, HZhang, XZhou, A Optimization of 5-(2,6-dichlorophenyl)-3-hydroxy-2-mercaptocyclohex-2-enones as potent inhibitors of human lactate dehydrogenase. Bioorg Med Chem Lett25:75-82 (2015) 
 
L-lactate dehydrogenase A chain
Name:L-lactate dehydrogenase A chain
Type:Protein
Mol. Mass.:36694.85
Organism:Homo sapiens (Human)
Description:P00338::PDB Code: 4ajp
Residue:332
BDBM50089926
NameBDBM50089926
Synonyms:CHEMBL3581201
TypeSmall organic molecule
Emp. Form.C22H19Cl2NO4S
Mol. Mass.464.362
SMILESCC(C)Oc1ccc(Cl)c(C2CC(O)=C(Sc3cc(O)ccc3C#N)C(=O)C2)c1Cl