Reaction Details
TargetL-lactate dehydrogenase A chain
LigandBDBM50089955
Substrate/Competitorn/a
Meas. Tech.ChEMBL_1499429 (CHEMBL3583864)
IC50 240±n/a nM
Citation Labadie, SDragovich, PSChen, JFauber, BPBoggs, JCorson, LBDing, CZEigenbrot, CGe, HHo, QLai, KWMa, SMalek, SPeterson, DPurkey, HERobarge, KSalphati, LSideris, SUltsch, MVanderPorten, EWei, BXu, QYen, IYue, QZhang, HZhang, XZhou, A Optimization of 5-(2,6-dichlorophenyl)-3-hydroxy-2-mercaptocyclohex-2-enones as potent inhibitors of human lactate dehydrogenase. Bioorg Med Chem Lett25:75-82 (2015) 
 
L-lactate dehydrogenase A chain
Name:L-lactate dehydrogenase A chain
Type:Protein
Mol. Mass.:36694.85
Organism:Homo sapiens (Human)
Description:P00338::PDB Code: 4ajp
Residue:332
BDBM50089955
NameBDBM50089955
Synonyms:CHEMBL3581173
TypeSmall organic molecule
Emp. Form.C22H20Cl3NO3S
Mol. Mass.484.823
SMILESOC1=C(Sc2ccccc2Cl)C(=O)CC(C1)c1c(Cl)ccc(N2CCOCC2)c1Cl