Reaction Details
TargetCannabinoid receptor 2
LigandBDBM50089968
Substrate/Competitorn/a
Meas. Tech.ChEMBL_1499459 (CHEMBL3583992)
Ki 82±n/a nM
Citation Harnett, JJDolo, CViossat, IAuger, FFerrandis, EBigg, DAuguet, MAuvin, SChabrier, PE Novel azoles as potent and selective cannabinoid CB2 receptor agonists. Bioorg Med Chem Lett25:88-91 (2015) 
 
Cannabinoid receptor 2
Name:Cannabinoid receptor 2
Type:G Protein-Coupled Receptor (GPCR)
Mol. Mass.:39690.94
Organism:Homo sapiens (Human)
Description:P34972
Residue:360
BDBM50089968
NameBDBM50089968
Synonyms:CHEMBL3581220
TypeSmall organic molecule
Emp. Form.C24H36N2OS2
Mol. Mass.432.685
SMILESCN(C)C1(CCSCC1)c1nc(cs1)-c1cc(c(O)c(c1)C(C)(C)C)C(C)(C)C