Reaction Details
TargetCannabinoid receptor 1
LigandBDBM50089959
Substrate/Competitorn/a
Meas. Tech.ChEMBL_1499460 (CHEMBL3583993)
Ki 3303±n/a nM
Citation Harnett, JJDolo, CViossat, IAuger, FFerrandis, EBigg, DAuguet, MAuvin, SChabrier, PE Novel azoles as potent and selective cannabinoid CB2 receptor agonists. Bioorg Med Chem Lett25:88-91 (2015) 
 
Cannabinoid receptor 1
Name:Cannabinoid receptor 1
Type:G Protein-Coupled Receptor (GPCR)
Mol. Mass.:52868.96
Organism:Homo sapiens (Human)
Description:P21554
Residue:472
BDBM50089959
NameBDBM50089959
Synonyms:CHEMBL3581225
TypeSmall organic molecule
Emp. Form.C26H40N2O2S
Mol. Mass.444.673
SMILESCCN(CC)C1(CCOCC1)c1nc(cs1)-c1cc(c(O)c(c1)C(C)(C)C)C(C)(C)C