Reaction Details
TargetEstrogen receptor
LigandBDBM50084948
Substrate/Competitorn/a
Meas. Tech.ChEMBL_1497878 (CHEMBL3582785)
IC50 6.0±n/a nM
Citation Lai, AKahraman, MGovek, SNagasawa, JBonnefous, CJulien, JDouglas, KSensintaffar, JLu, NLee, KJAparicio, AKaufman, JQian, JShao, GPrudente, RMoon, MJJoseph, JDDarimont, BBrigham, DGrillot, KHeyman, RRix, PJHager, JHSmith, ND Identification of GDC-0810 (ARN-810), an Orally Bioavailable Selective Estrogen Receptor Degrader (SERD) that Demonstrates Robust Activity in Tamoxifen-Resistant Breast Cancer Xenografts. J Med Chem58:4888-904 (2015) 
 
Estrogen receptor
Name:Estrogen receptor
Type:Protein
Mol. Mass.:66230.44
Organism:Homo sapiens (Human)
Description:P03372
Residue:595
BDBM50084948
NameBDBM50084948
Synonyms:CHEMBL195515 | GW7604
TypeSmall organic molecule
Emp. Form.C25H22O3
Mol. Mass.370.4404
SMILESCC\C(=C(/c1ccc(O)cc1)c1ccc(\C=C\C(O)=O)cc1)c1ccccc1