Reaction Details
TargetEstrogen receptor beta
LigandBDBM19442
Substrate/Competitorn/a
Meas. Tech.ChEMBL_1497879 (CHEMBL3582786)
IC50 240±n/a nM
Citation Lai, AKahraman, MGovek, SNagasawa, JBonnefous, CJulien, JDouglas, KSensintaffar, JLu, NLee, KJAparicio, AKaufman, JQian, JShao, GPrudente, RMoon, MJJoseph, JDDarimont, BBrigham, DGrillot, KHeyman, RRix, PJHager, JHSmith, ND Identification of GDC-0810 (ARN-810), an Orally Bioavailable Selective Estrogen Receptor Degrader (SERD) that Demonstrates Robust Activity in Tamoxifen-Resistant Breast Cancer Xenografts. J Med Chem58:4888-904 (2015) 
 
Estrogen receptor beta
Name:Estrogen receptor beta
Type:Protein
Mol. Mass.:59238.43
Organism:Homo sapiens (Human)
Description:Q92731
Residue:530
BDBM19442
NameBDBM19442
Synonyms:2-(4-methoxyphenyl)-3-[4-(2-piperidin-1-ylethoxy)phenoxy]-1-benzothiophen-6-ol Arzoxifene
TypeSmall organic molecule
Emp. Form.C28H29NO4S
Mol. Mass.475.599
SMILESCOc1ccc(cc1)-c1sc2cc(O)ccc2c1Oc1ccc(OCCN2CCCCC2)cc1