Reaction Details
TargetEstrogen receptor
LigandBDBM50169743
Substrate/Competitorn/a
Meas. Tech.ChEMBL_1497713 (CHEMBL3582719)
EC50 0.400000±n/a nM
Citation Lai, AKahraman, MGovek, SNagasawa, JBonnefous, CJulien, JDouglas, KSensintaffar, JLu, NLee, KJAparicio, AKaufman, JQian, JShao, GPrudente, RMoon, MJJoseph, JDDarimont, BBrigham, DGrillot, KHeyman, RRix, PJHager, JHSmith, ND Identification of GDC-0810 (ARN-810), an Orally Bioavailable Selective Estrogen Receptor Degrader (SERD) that Demonstrates Robust Activity in Tamoxifen-Resistant Breast Cancer Xenografts. J Med Chem58:4888-904 (2015) 
 
Estrogen receptor
Name:Estrogen receptor
Type:Protein
Mol. Mass.:66230.44
Organism:Homo sapiens (Human)
Description:P03372
Residue:595
BDBM50169743
NameBDBM50169743
Synonyms:(13S,17S)-13-Methyl-7-[9-(4,4,5,5,5-pentafluoro-pentane-1-sulfinyl)-nonyl]-7,8,9,11,12,13,14,15,16,17-decahydro-6H-cyclopenta[a]phenanthrene-3,17-diol (7R,13S,17S)-13-methyl-7-(9-(4,4,5,5,5-pentafluoropentylsulfinyl)nonyl)-7,8,9,11,12,13,14,15,16,17-decahydro-6H-cyclopenta[a]phenanthrene-3,17-diol (7R,8R,9S,13S,14S,17S)-13-methyl-7-(9-(4,4,5,5,5-pentafluoropentyldihydrosulfinyl)nonyl)-7,8,9,11,12,13,14,15,16,17-decahydro-6H-cyclopenta[a]phenanthrene-3,17-diol 13-Methyl-7-[9-(4,4,5,5,5-pentafluoro-pentane-1-sulfinyl)-nonyl]-7,8,9,11,12,13,14,15,16,17-decahydro-6H-cyclopenta[a]phenanthrene-3,17-diol FULVESTRANT Fluvestrant US10227334, Fulvestrant | ZD-9238
TypeSmall organic molecule
Emp. Form.C32H47F5O3S
Mol. Mass.606.771
SMILESC[C@]12CC[C@H]3[C@H]([C@@H]1CC[C@@H]2O)[C@H](CCCCCCCCCS(=O)CCCC(F)(F)C(F)(F)F)Cc1cc(O)ccc31