Reaction Details
TargetSignal transducer and activator of transcription 3
LigandBDBM50090479
Substrate/Competitorn/a
Meas. Tech.ChEMBL_1498280 (CHEMBL3583801)
IC50>30000±n/a nM
Citation Lee, CLee, JWJin, QJang, HJang, HJRho, MCLee, MKLee, CKLee, MKHwang, BY Isolation and Characterization of Dammarane-Type Saponins from Gynostemma pentaphyllum and Their Inhibitory Effects on IL-6-Induced STAT3 Activation. J Nat Prod78:971-6 (2015) 
 
Signal transducer and activator of transcription 3
Name:Signal transducer and activator of transcription 3
Type:Protein
Mol. Mass.:88064.31
Organism:Homo sapiens (Human)
Description:P40763
Residue:770
BDBM50090479
NameBDBM50090479
Synonyms:CHEMBL3581704
TypeSmall organic molecule
Emp. Form.C54H92O23
Mol. Mass.1109.2945
SMILES[H][C@@]1(CC[C@]2(C)[C@]1([H])[C@H](O)C[C@]1([H])[C@@]3(C)C[C@@H](O)[C@H](O[C@@H]4O[C@H](CO)[C@@H](O)[C@H](O)[C@H]4O[C@@H]4O[C@H](CO)[C@@H](O)[C@H](O)[C@H]4O)C(C)(C)[C@]3([H])CC[C@@]21C)[C@](C)(C\C=C\C(C)C)O[C@@H]1O[C@H](CO[C@@H]2O[C@@H](C)[C@H](O)[C@@H](O)[C@H]2O)[C@@H](O)[C@H](O)[C@H]1O