Reaction Details
TargetAlpha-1,6-mannosyl-glycoprotein 2-beta-N-acetylglucosaminyltransferase
LigandBDBM50090648
Substrate/Competitorn/a
Meas. Tech.ChEMBL_1498282 (CHEMBL3583803)
IC50 2.2±n/a nM
Citation Sato, KTakahagi, HYoshikawa, TMorimoto, STakai, THidaka, KKamaura, MKubo, OAdachi, RIshii, TMaki, TMochida, TTakekawa, SNakakariya, MAmano, NKitazaki, T Discovery of a Novel Series of N-Phenylindoline-5-sulfonamide Derivatives as Potent, Selective, and Orally Bioavailable Acyl CoA:Monoacylglycerol Acyltransferase-2 Inhibitors. J Med Chem58:3892-909 (2015) 
 
Alpha-1,6-mannosyl-glycoprotein 2-beta-N-acetylglucosaminyltransferase
Name:Alpha-1,6-mannosyl-glycoprotein 2-beta-N-acetylglucosaminyltransferase
Type:n/a
Mol. Mass.:51567.80
Organism:Homo sapiens (Human)
Description:Q10469
Residue:447
BDBM50090648
NameBDBM50090648
Synonyms:CHEMBL3581732
TypeSmall organic molecule
Emp. Form.C26H24F2N4O5S
Mol. Mass.542.554
SMILESFc1ccc(NS(=O)(=O)c2cc3CCN(C(=O)OCc4ccccc4)c3c(c2)N2CCCNC2=O)c(F)c1