Reaction Details
TargetNociceptin receptor
LigandBDBM50090731
Substrate/Competitorn/a
Meas. Tech.ChEMBL_1498305 (CHEMBL3583928)
EC50 14±n/a nM
Citation Cueva, JPRoche, COstovar, MKumar, VClark, MJHillhouse, TMLewis, JWTraynor, JRHusbands, SM C7ß-methyl analogues of the orvinols: the discovery of kappa opioid antagonists with nociceptin/orphanin FQ peptide (NOP) receptor partial agonism and low, or zero, efficacy at mu opioid receptors. J Med Chem58:4242-9 (2015) 
 
Nociceptin receptor
Name:Nociceptin receptor
Type:G Protein-Coupled Receptor (GPCR)
Mol. Mass.:40702.87
Organism:Homo sapiens (Human)
Description:P41146
Residue:370
BDBM50090731
NameBDBM50090731
Synonyms:CHEMBL3581741 US9480684, 22, R = 3- MePh- BU10112
TypeSmall organic molecule
Emp. Form.C32H37NO4
Mol. Mass.499.6405
SMILES[H][C@@]12Oc3c4c(C[C@@]5([H])N(CC6CC6)CC[C@@]14[C@]51C[C@](C)([C@H](O)c4cccc(C)c4)[C@]2(OC)C=C1)ccc3O