Reaction Details
TargetNociceptin receptor
LigandBDBM50090755
Substrate/Competitorn/a
Meas. Tech.ChEMBL_1498305 (CHEMBL3583928)
EC50 7.3±n/a nM
Citation Cueva, JPRoche, COstovar, MKumar, VClark, MJHillhouse, TMLewis, JWTraynor, JRHusbands, SM C7ß-methyl analogues of the orvinols: the discovery of kappa opioid antagonists with nociceptin/orphanin FQ peptide (NOP) receptor partial agonism and low, or zero, efficacy at mu opioid receptors. J Med Chem58:4242-9 (2015) 
 
Nociceptin receptor
Name:Nociceptin receptor
Type:G Protein-Coupled Receptor (GPCR)
Mol. Mass.:40702.87
Organism:Homo sapiens (Human)
Description:P41146
Residue:370
BDBM50090755
NameBDBM50090755
Synonyms:CHEMBL3581743 US9480684, 22, R = 4- FPh- BU10120
TypeSmall organic molecule
Emp. Form.C31H34FNO4
Mol. Mass.503.6044
SMILES[H][C@@]12Oc3c4c(C[C@@]5([H])N(CC6CC6)CC[C@@]14[C@]51C[C@](C)([C@H](O)c4ccc(F)cc4)[C@]2(OC)C=C1)ccc3O