Reaction Details
TargetKappa-type opioid receptor
LigandBDBM50090768
Substrate/Competitorn/a
Meas. Tech.ChEMBL_1498308 (CHEMBL3583931)
Ki 0.140000±n/a nM
Citation Cueva, JPRoche, COstovar, MKumar, VClark, MJHillhouse, TMLewis, JWTraynor, JRHusbands, SM C7ß-methyl analogues of the orvinols: the discovery of kappa opioid antagonists with nociceptin/orphanin FQ peptide (NOP) receptor partial agonism and low, or zero, efficacy at mu opioid receptors. J Med Chem58:4242-9 (2015) 
 
Kappa-type opioid receptor
Name:Kappa-type opioid receptor
Type:G Protein-Coupled Receptor (GPCR)
Mol. Mass.:42648.76
Organism:Homo sapiens (Human)
Description:P41145
Residue:380
BDBM50090768
NameBDBM50090768
Synonyms:CHEMBL3581762
TypeSmall organic molecule
Emp. Form.C29H35NO5
Mol. Mass.477.5919
SMILES[H][C@@]12Oc3c4c(C[C@@]5([H])N(CC6CC6)CC[C@@]14[C@@]51CC[C@@]2(OC)[C@](C)(C1)[C@H](O)c1ccoc1)ccc3O