Reaction Details
TargetDelta-type opioid receptor
LigandBDBM50090694
Substrate/Competitorn/a
Meas. Tech.ChEMBL_1498310 (CHEMBL3583933)
Ki 0.480000±n/a nM
Citation Cueva, JPRoche, COstovar, MKumar, VClark, MJHillhouse, TMLewis, JWTraynor, JRHusbands, SM C7ß-methyl analogues of the orvinols: the discovery of kappa opioid antagonists with nociceptin/orphanin FQ peptide (NOP) receptor partial agonism and low, or zero, efficacy at mu opioid receptors. J Med Chem58:4242-9 (2015) 
 
Delta-type opioid receptor
Name:Delta-type opioid receptor
Type:G Protein-Coupled Receptor (GPCR)
Mol. Mass.:40465.04
Organism:Rattus norvegicus (rat)
Description:Competition binding assays were using CHO-K1 cell membranes expressing the opioid receptor.
Residue:372
BDBM50090694
NameBDBM50090694
Synonyms:CHEMBL3581740 US9480684, 22, R = Ph- BU128
TypeSmall organic molecule
Emp. Form.C31H35NO4
Mol. Mass.485.6139
SMILES[H][C@@]12Oc3c4c(C[C@@]5([H])N(CC6CC6)CC[C@@]14[C@]51C[C@](C)([C@H](O)c4ccccc4)[C@]2(OC)C=C1)ccc3O