Reaction Details
TargetGlycogen synthase kinase-3 beta
LigandBDBM50090908
Substrate/Competitorn/a
Meas. Tech.ChEMBL_1498490 (CHEMBL3584608)
IC50 3000±n/a nM
Citation Ohishi, KToume, KArai, MAKoyano, TKowithayakorn, TMizoguchi, TItoh, MIshibashi, M 9-Hydroxycanthin-6-one, aß-Carboline Alkaloid from Eurycoma longifolia, Is the First Wnt Signal Inhibitor through Activation of Glycogen Synthase Kinase 3ß without Depending on Casein Kinase 1a. J Nat Prod78:1139-46 (2015) 
 
Glycogen synthase kinase-3 beta
Name:Glycogen synthase kinase-3 beta
Type:Enzyme
Mol. Mass.:46756.38
Organism:Homo sapiens (Human)
Description:P49841
Residue:420
BDBM50090908
NameBDBM50090908
Synonyms:CHEBI:67291 | CHEMBL1774404
TypeSmall organic molecule
Emp. Form.C28H38O5
Mol. Mass.454.5983
SMILES[H][C@@]1(COC(=O)C1)[C@]1([H])CC=C2[C@@]1(C)CC[C@@]1([H])[C@@]2(C)[C@@H](C[C@@]2([H])C(C)(C)C(=O)C=C[C@]12C)OC(C)=O