Reaction Details
TargetCannabinoid receptor 2
LigandBDBM50090959
Substrate/Competitorn/a
Meas. Tech.ChEMBL_1499669 (CHEMBL3584846)
Ki 1047±n/a nM
Citation Slavik, RGrether, UMüller Herde, AGobbi, LFingerle, JUllmer, CKrämer, SDSchibli, RMu, LAmetamey, SM Discovery of a high affinity and selective pyridine analog as a potential positron emission tomography imaging agent for cannabinoid type 2 receptor. J Med Chem58:4266-77 (2015) 
 
Cannabinoid receptor 2
Name:Cannabinoid receptor 2
Type:Enzyme Catalytic Domain
Mol. Mass.:38220.43
Organism:MOUSE
Description:P47936
Residue:347
BDBM50090959
NameBDBM50090959
Synonyms:CHEMBL3582021
TypeSmall organic molecule
Emp. Form.C25H26F3N5O3
Mol. Mass.501.5008
SMILESCC(C)(Cc1nnc(o1)-c1ccc(F)cc1)NC(=O)c1ccc(N2CC(F)(F)C2)c(OCC2CC2)n1