Reaction Details
TargetCannabinoid receptor 2
LigandBDBM50090950
Substrate/Competitorn/a
Meas. Tech.ChEMBL_1499669 (CHEMBL3584846)
Ki 1.8±n/a nM
Citation Slavik, RGrether, UMüller Herde, AGobbi, LFingerle, JUllmer, CKrämer, SDSchibli, RMu, LAmetamey, SM Discovery of a high affinity and selective pyridine analog as a potential positron emission tomography imaging agent for cannabinoid type 2 receptor. J Med Chem58:4266-77 (2015) 
 
Cannabinoid receptor 2
Name:Cannabinoid receptor 2
Type:Enzyme Catalytic Domain
Mol. Mass.:38220.43
Organism:MOUSE
Description:P47936
Residue:347
BDBM50090950
NameBDBM50090950
Synonyms:CHEMBL3582008
TypeSmall organic molecule
Emp. Form.C22H33N3O5
Mol. Mass.419.5145
SMILESCCOC(=O)C(CC)(CC)NC(=O)c1ccc(N2CC(C2)OC)c(OCC2CC2)n1