Reaction Details
TargetCannabinoid receptor 2
LigandBDBM50090963
Substrate/Competitorn/a
Meas. Tech.ChEMBL_1499668 (CHEMBL3584845)
Ki 179±n/a nM
Citation Slavik, RGrether, UMüller Herde, AGobbi, LFingerle, JUllmer, CKrämer, SDSchibli, RMu, LAmetamey, SM Discovery of a high affinity and selective pyridine analog as a potential positron emission tomography imaging agent for cannabinoid type 2 receptor. J Med Chem58:4266-77 (2015) 
 
Cannabinoid receptor 2
Name:Cannabinoid receptor 2
Type:G Protein-Coupled Receptor (GPCR)
Mol. Mass.:39690.94
Organism:Homo sapiens (Human)
Description:P34972
Residue:360
BDBM50090963
NameBDBM50090963
Synonyms:CHEMBL3582018 | US9290451, 86
TypeSmall organic molecule
Emp. Form.C20H28F2N4O3
Mol. Mass.410.4581
SMILESCCC(CC)(NC(=O)c1ccc(N2CC(F)(F)C2)c(OCC2CC2)n1)C(=O)NC