Reaction Details
TargetMacrophage-stimulating protein receptor
LigandBDBM50091030
Substrate/Competitorn/a
Meas. Tech.ChEMBL_1499715 (CHEMBL3585031)
IC50 10.0±n/a nM
Citation Raeppel, SLRaeppel, FTherrien, E Design and synthesis of close analogs of LCRF-0004, a potent and selective RON receptor tyrosine kinase inhibitor. Bioorg Med Chem Lett25:2527-31 (2015) 
 
Macrophage-stimulating protein receptor
Name:Macrophage-stimulating protein receptor
Type:Protein
Mol. Mass.:152270.76
Organism:Homo sapiens (Human)
Description:Q04912
Residue:1400
BDBM50091030
NameBDBM50091030
Synonyms:CHEMBL3582033
TypeSmall organic molecule
Emp. Form.C29H19F4N5O2S
Mol. Mass.577.552
SMILESCn1cnc(c1)-c1cc2nccc(Oc3ccc(NC(=O)c4ccn(c4C(F)(F)F)-c4ccccc4)cc3F)c2s1