Reaction Details
TargetMacrophage-stimulating protein receptor
LigandBDBM50317323
Substrate/Competitorn/a
Meas. Tech.ChEMBL_1499718 (CHEMBL3585034)
IC50 30±n/a nM
Citation Raeppel, SLRaeppel, FTherrien, E Design and synthesis of close analogs of LCRF-0004, a potent and selective RON receptor tyrosine kinase inhibitor. Bioorg Med Chem Lett25:2527-31 (2015) 
 
Macrophage-stimulating protein receptor
Name:Macrophage-stimulating protein receptor
Type:Protein
Mol. Mass.:152270.76
Organism:Homo sapiens (Human)
Description:Q04912
Residue:1400
BDBM50317323
NameBDBM50317323
Synonyms:CHEMBL1094718 | N-(3-fluoro-4-(2-(1-methyl-1H-imidazol-4-yl)thieno[3,2-b]pyridin-7-yloxy)phenyl)-1-phenyl-5-(trifluoromethyl)-1H-pyrazole-4-carboxamide
TypeSmall organic molecule
Emp. Form.C28H18F4N6O2S
Mol. Mass.578.54
SMILESCn1cnc(c1)-c1cc2nccc(Oc3ccc(NC(=O)c4cnn(c4C(F)(F)F)-c4ccccc4)cc3F)c2s1