Reaction Details
TargetProgesterone receptor
LigandBDBM50086550
Substrate/Competitorn/a
Meas. Tech.ChEMBL_1500023 (CHEMBL3584019)
Ki 3.9±n/a nM
Citation Eda, MKuroda, TKaneko, SAoki, YYamashita, MOkumura, CIkeda, YOhbora, TSakaue, MKoyama, NAritomo, K Synthesis and Biological Evaluation of Cyclopentaquinoline Derivatives as Nonsteroidal Glucocorticoid Receptor Antagonists. J Med Chem58:4918-26 (2015) 
 
Progesterone receptor
Name:Progesterone receptor
Type:Protein
Mol. Mass.:98979.52
Organism:Homo sapiens (Human)
Description:P06401
Residue:933
BDBM50086550
NameBDBM50086550
Synonyms:4-Methyl-5-(2,2,4,4-tetramethyl-3-oxo-1,2,3,4-tetrahydro-quinolin-6-yl)-thiophene-2-carbonitrile CHEMBL132889
TypeSmall organic molecule
Emp. Form.C19H20N2OS
Mol. Mass.324.44
SMILESCc1cc(sc1-c1ccc2NC(C)(C)C(=O)C(C)(C)c2c1)C#N