Reaction Details
TargetATP-dependent translocase ABCB1
LigandBDBM50091264
Substrate/Competitorn/a
Meas. Tech.ChEMBL_1500054 (CHEMBL3584050)
IC50 3.0±n/a nM
Citation Wong, ILWang, BCYuan, JDuan, LXLiu, ZLiu, TLi, XMHu, XZhang, XYJiang, TWan, SBChow, LM Potent and Nontoxic Chemosensitizer of P-Glycoprotein-Mediated Multidrug Resistance in Cancer: Synthesis and Evaluation of Methylated Epigallocatechin, Gallocatechin, and Dihydromyricetin Derivatives. J Med Chem58:4529-49 (2015) 
 
ATP-dependent translocase ABCB1
Name:ATP-dependent translocase ABCB1
Type:Protein
Mol. Mass.:141503.50
Organism:Homo sapiens (Human)
Description:P08183
Residue:1280
BDBM50091264
NameBDBM50091264
Synonyms:CHEMBL3582155
TypeSmall organic molecule
Emp. Form.C36H36FNO11
Mol. Mass.677.6695
SMILESCOc1cc(OC)c2C[C@@H](OC(=O)c3ccc(F)c(NC(=O)c4ccc(OC)c(OC)c4)c3)[C@H](Oc2c1)c1cc(OC)c(OC)c(OC)c1