Reaction Details
TargetATP-dependent translocase ABCB1
LigandBDBM50091271
Substrate/Competitorn/a
Meas. Tech.ChEMBL_1500054 (CHEMBL3584050)
IC50 8.7±n/a nM
Citation Wong, ILWang, BCYuan, JDuan, LXLiu, ZLiu, TLi, XMHu, XZhang, XYJiang, TWan, SBChow, LM Potent and Nontoxic Chemosensitizer of P-Glycoprotein-Mediated Multidrug Resistance in Cancer: Synthesis and Evaluation of Methylated Epigallocatechin, Gallocatechin, and Dihydromyricetin Derivatives. J Med Chem58:4529-49 (2015) 
 
ATP-dependent translocase ABCB1
Name:ATP-dependent translocase ABCB1
Type:Protein
Mol. Mass.:141503.50
Organism:Homo sapiens (Human)
Description:P08183
Residue:1280
BDBM50091271
NameBDBM50091271
Synonyms:CHEMBL3582148
TypeSmall organic molecule
Emp. Form.C31H34O10
Mol. Mass.566.5957
SMILESCOc1cc(OC)c2C[C@@H](OC(=O)\C=C\c3ccc(OC)c(OC)c3)[C@H](Oc2c1)c1cc(OC)c(OC)c(OC)c1