Reaction Details
TargetATP-dependent translocase ABCB1
LigandBDBM50091268
Substrate/Competitorn/a
Meas. Tech.ChEMBL_1500054 (CHEMBL3584050)
IC50 18±n/a nM
Citation Wong, ILWang, BCYuan, JDuan, LXLiu, ZLiu, TLi, XMHu, XZhang, XYJiang, TWan, SBChow, LM Potent and Nontoxic Chemosensitizer of P-Glycoprotein-Mediated Multidrug Resistance in Cancer: Synthesis and Evaluation of Methylated Epigallocatechin, Gallocatechin, and Dihydromyricetin Derivatives. J Med Chem58:4529-49 (2015) 
 
ATP-dependent translocase ABCB1
Name:ATP-dependent translocase ABCB1
Type:Protein
Mol. Mass.:141503.50
Organism:Homo sapiens (Human)
Description:P08183
Residue:1280
BDBM50091268
NameBDBM50091268
Synonyms:CHEMBL3582152
TypeSmall organic molecule
Emp. Form.C32H38O11
Mol. Mass.598.6375
SMILESCOc1cc(OC)c2C[C@@H](OC(=O)CCc3cc(OC)c(OC)c(OC)c3)[C@H](Oc2c1)c1cc(OC)c(OC)c(OC)c1