Reaction Details
TargetATP-dependent translocase ABCB1
LigandBDBM50091088
Substrate/Competitorn/a
Meas. Tech.ChEMBL_1500054 (CHEMBL3584050)
IC50 16±n/a nM
Citation Wong, ILWang, BCYuan, JDuan, LXLiu, ZLiu, TLi, XMHu, XZhang, XYJiang, TWan, SBChow, LM Potent and Nontoxic Chemosensitizer of P-Glycoprotein-Mediated Multidrug Resistance in Cancer: Synthesis and Evaluation of Methylated Epigallocatechin, Gallocatechin, and Dihydromyricetin Derivatives. J Med Chem58:4529-49 (2015) 
 
ATP-dependent translocase ABCB1
Name:ATP-dependent translocase ABCB1
Type:Protein
Mol. Mass.:141503.50
Organism:Homo sapiens (Human)
Description:P08183
Residue:1280
BDBM50091088
NameBDBM50091088
Synonyms:CHEMBL3582157
TypeSmall organic molecule
Emp. Form.C42H38F2N2O11
Mol. Mass.784.7547
SMILESCOc1ccc(cc1)C(=O)Nc1cc(ccc1F)C(=O)Nc1cc(ccc1F)C(=O)O[C@@H]1Cc2c(OC)cc(OC)cc2O[C@@H]1c1cc(OC)c(OC)c(OC)c1