Reaction Details
TargetATP-dependent translocase ABCB1
LigandBDBM50091227
Substrate/Competitorn/a
Meas. Tech.ChEMBL_1500054 (CHEMBL3584050)
IC50 15±n/a nM
Citation Wong, ILWang, BCYuan, JDuan, LXLiu, ZLiu, TLi, XMHu, XZhang, XYJiang, TWan, SBChow, LM Potent and Nontoxic Chemosensitizer of P-Glycoprotein-Mediated Multidrug Resistance in Cancer: Synthesis and Evaluation of Methylated Epigallocatechin, Gallocatechin, and Dihydromyricetin Derivatives. J Med Chem58:4529-49 (2015) 
 
ATP-dependent translocase ABCB1
Name:ATP-dependent translocase ABCB1
Type:Protein
Mol. Mass.:141503.50
Organism:Homo sapiens (Human)
Description:P08183
Residue:1280
BDBM50091227
NameBDBM50091227
Synonyms:CHEMBL3582143
TypeSmall organic molecule
Emp. Form.C29H30FNO9
Mol. Mass.555.5482
SMILESCOc1cc(OC)c2C[C@@H](OC(=O)c3ccc(F)c(NC(C)=O)c3)[C@H](Oc2c1)c1cc(OC)c(OC)c(OC)c1