Reaction Details
TargetSerine/threonine-protein kinase Chk1
LigandBDBM50091321
Substrate/Competitorn/a
Meas. Tech.ChEMBL_1500168 (CHEMBL3584717)
IC50 10±n/a nM
Citation Gazzard, LWilliams, KChen, HAxford, LBlackwood, EBurton, BChapman, KCrackett, PDrobnick, JEllwood, CEpler, JFlagella, MGancia, EGill, MGoodacre, SHalladay, JHewitt, JHunt, HKintz, SLyssikatos, JMacleod, CMajor, SMédard, GNarukulla, RRamiscal, JSchmidt, SSeward, EWiesmann, CWu, PYee, SYen, IMalek, S Mitigation of Acetylcholine Esterase Activity in the 1,7-Diazacarbazole Series of Inhibitors of Checkpoint Kinase 1. J Med Chem58:5053-74 (2015) 
 
Serine/threonine-protein kinase Chk1
Name:Serine/threonine-protein kinase Chk1
Type:Enzyme Catalytic Domain
Mol. Mass.:54443.02
Organism:Homo sapiens (Human)
Description:gi_166295192
Residue:476
BDBM50091321
NameBDBM50091321
Synonyms:CHEMBL3582206
TypeSmall organic molecule
Emp. Form.C25H25N5
Mol. Mass.395.4995
SMILESCC(C)(N1CCCCC1)c1ccc(cc1)-c1cnc2[nH]c3cnc(cc3c2c1)C#N