Reaction Details
TargetSerine/threonine-protein kinase Chk1
LigandBDBM50091314
Substrate/Competitorn/a
Meas. Tech.ChEMBL_1500168 (CHEMBL3584717)
IC50 5.3±n/a nM
Citation Gazzard, LWilliams, KChen, HAxford, LBlackwood, EBurton, BChapman, KCrackett, PDrobnick, JEllwood, CEpler, JFlagella, MGancia, EGill, MGoodacre, SHalladay, JHewitt, JHunt, HKintz, SLyssikatos, JMacleod, CMajor, SMédard, GNarukulla, RRamiscal, JSchmidt, SSeward, EWiesmann, CWu, PYee, SYen, IMalek, S Mitigation of Acetylcholine Esterase Activity in the 1,7-Diazacarbazole Series of Inhibitors of Checkpoint Kinase 1. J Med Chem58:5053-74 (2015) 
 
Serine/threonine-protein kinase Chk1
Name:Serine/threonine-protein kinase Chk1
Type:Enzyme Catalytic Domain
Mol. Mass.:54443.02
Organism:Homo sapiens (Human)
Description:gi_166295192
Residue:476
BDBM50091314
NameBDBM50091314
Synonyms:CHEMBL3582213
TypeSmall organic molecule
Emp. Form.C22H20N6
Mol. Mass.368.4344
SMILESN#Cc1cc2c(cn1)[nH]c1ncc(cc21)-c1ccc(CN2CCCCC2)nc1