Reaction Details
TargetProgrammed cell death 1 ligand 1
LigandBDBM50091333
Substrate/Competitorn/a
Meas. Tech.ChEMBL_1497759 (CHEMBL3583018)
IC50 110±n/a nM
Citation Abdel-Magid, AF Inhibitors of the PD-1/PD-L1 Pathway Can Mobilize the Immune System: An Innovative Potential Therapy for Cancer and Chronic Infections. ACS Med Chem Lett6:489-90 (2015) 
 
Programmed cell death 1 ligand 1
Name:Programmed cell death 1 ligand 1
Type:PROTEIN
Mol. Mass.:33278.49
Organism:Homo sapiens (Human)
Description:ChEMBL_109807
Residue:290
BDBM50091333
NameBDBM50091333
Synonyms:CHEMBL3582253
TypeSmall organic molecule
Emp. Form.C30H36N2O3
Mol. Mass.472.6184
SMILESCc1cc(CN2CCC(CC2)C(=O)NCCO)ccc1OCc1cccc(c1C)-c1ccccc1